{"text_format":"1","workbook":"xlsx","n_sheets":7,"sheets":["Lists","Summary","WAG Gymnasts","WAG Coaches & Judges","MAG Gymnasts","MAG Coaches & Judges","Pswd"],"not_rendered":{"charts":0,"images":1,"macros":1,"external_links":1,"defined_names":69,"comments":1,"pivot_tables":0},"unopened":[],"bounds":{"document_bytes":16777216,"sheet_cells":100000,"rows_first":2000,"rows_last":500,"rows_between":2000,"halvings":0,"cell_chars":16384,"cell_head_chars":4096},"cells_cut":0,"cells_raw":0,"read":"whole","date_system":"1900"}

{"sheet":"Lists","index":0,"n_rows":66,"n_cols":30,"rows_kept":66,"cut":false,"hidden":true,"merged":[]}
["Lists used on other sheets…",null,null,"Year of Meet: ",2018,null,null,"Meet Name: ","2018 Marian Classic",null,null,null,null,null,"Yes No Reply"]
[null,null,null,null,null,null,null,"Dates: ","February 9-11, 2018",null,null,null,null,null,"Yes"]
["Note: ","Hide this sheet normally, ",null,null,null,null,null,"Deadline: ","Tues. Jan. 16, 2018",null,null,null,null,null,"No"]
[null,"especially before sending the file to clubs.",null,null,null,null,null,"Late Entrry Fee: ",50,null,null,null,null,null,null,null,"Note: Change these age groups within the categories as needed - see Gym Sask guide in November each year for the following season."]
[null,null,null,null,null,null,null,null,null,null,null,null,"Year of Competition: ",{"$f":"Year_of_Meet","v":2018},"**  Ages shown are as of end of previous year (aka the start of this year).  "]
[null,"FEES:",null,null,null,null,null,"Invited Gym Clubs…",null,null,null,"Code for",null,"Year Born:",{"$f":"N5-6","v":2012},{"$f":"O6-1","v":2011},{"$f":"P6-1","v":2010},2009,2008,2007,2006,2005,2004,2003,2002,2001,2000,1999,1998,1997]
[null,"Level","$/gymnast","# gymnasts",null,null,"Prov.","Club_Abbr","Club_Name","Club_City",null,"Fees Level","WAG_Categories  ",{"$f":"\"Age at start of \" &$N$5&\":\"","v":"Age at start of 2018:"},{"$f":"$N$5-O6-1","v":5},{"$f":"O7+1","v":6},{"$f":"P7+1","v":7},8,9,10,11,12,13,14,15,16,17,18,19,20]
["WAG","Interclub:  Dev, Masters",null,{"$f":"COUNTIF('WAG Gymnasts'!$M$5:$M$64,$E8)","v":0},1,1," SK","Airborne","Airborne Gymnastics Club","Weyburn",null,1,"Interclub: ","Masters","X"]
["WAG","Interclub:  JO 1-2",60,{"$f":"COUNTIF('WAG Gymnasts'!$M$5:$M$64,$E9)","v":0},2,2," SK","Battleford","Battlefords Gymnastics Club","North Battleford",null,1,"Interclub: ","Developmental","X"]
["WAG","Prov:  JO 3-8, JO 9(P)",90,{"$f":"COUNTIF('WAG Gymnasts'!$M$5:$M$64,$E10)","v":0},3,3," SK","Calico","Calico Gymnastics Club","Humboldt",null,2,"Interclub: ","JO-1","X"]
["WAG","Nat'l:  JO 9(N), JO 10",90,{"$f":"COUNTIF('WAG Gymnasts'!$M$5:$M$64,$E11)","v":0},4,4," SK","Can-Am","Can-Am Gymnastics Club","Saskatoon",null,2,"Interclub: ","JO-2","X"]
["WAG","Aspire 1-2",90,{"$f":"COUNTIF('WAG Gymnasts'!$M$5:$M$64,$E12)","v":0},5,5," SK","Estevan","Estevan Gymnastics Club","Estevan",null,3,"Provincial: ","JO-3","X","X","2009-2010","2009-2010",2008,2007,"2005-2006","2005-2006","2004 & before","2004 & before","2004 & before","2004 & before","2004 & before","2004 & before","2004 & before","2004 & before"]
["WAG","High Performance",90,{"$f":"COUNTIF('WAG Gymnasts'!$M$5:$M$64,$E13)","v":0},6,6," SK","Explosion","Explosion Gymnastics Club","Lloydminster",null,3,"Provincial: ","JO-4","X","X","X","2008-2009","2008-2009","2007 & before","2007 & before","2007 & before","2007 & before","2007 & before","2007 & before","2007 & before","2007 & before","2007 & before","2007 & before","2007 & before"]
["MAG","Interclub:  Masters",null,{"$f":"COUNTIF('MAG Gymnasts'!$M$5:$M$64,$E14)","v":0},1,7," SK","Gelico","Gelico Gymnastics Club","Swift Current",null,3,"Provincial: ","JO-5","X","X","X","2009 & before","2005 & before","2005 & before","2005 & before","2005 & before","2005 & before","2005 & before","2005 & before","2005 & before","2005 & before","2005 & before","2005 & before","2005 & before"]
["MAG","Interclub:  JO-1, JO-2, JO-3",null,{"$f":"COUNTIF('MAG Gymnasts'!$M$5:$M$64,$E15)","v":0},2,8," SK","Gym Adv","Gymnastics Adventure Inc.","Regina",null,3,"Provincial: ","JO-6","X","X","X","2007-2009","2007-2009","2007-2009","2005-2006","2005-2006","2004 & before","2004 & before","2004 & before","2004 & before","2004 & before","2004 & before","2004 & before","2004 & before"]
["MAG","Prov:  JO 4-7",null,{"$f":"COUNTIF('MAG Gymnasts'!$M$5:$M$64,$E16)","v":0},3,9," SK","Gymtastiks","Gymtastiks Gymnastics Club","Moose Jaw",null,3,"Provincial: ","JO-7","X","X","X","X","2006-2008","2006-2008","2006-2008","2005 & before","2005 & before","2005 & before","2005 & before","2005 & before","2005 & before","2005 & before","2005 & before","2005 & before"]
["MAG","Prov:  P4 - P5",null,{"$f":"COUNTIF('MAG Gymnasts'!$M$5:$M$64,$E17)","v":0},4,10," SK","Jumpers","Moose Mountain Jumpers Gymnastics Club","Carlyle",null,3,"Provincial: ","JO-8","X","X","X","X","2006-2008","2006-2008","2006-2008","2005 & before","2005 & before","2005 & before","2005 & before","2005 & before","2005 & before","2005 & before","2005 & before","2005 & before"]
["MAG","Nat'l:  Elite 3-4",null,{"$f":"COUNTIF('MAG Gymnasts'!$M$5:$M$64,$E18)","v":0},5,11," SK","Leapers","Lampman Leapers Gymnastics Club","Lampman",null,3,"Provincial: ","JO-9 (Prov)","X","X","X","X","X","X","X","X","2004 & before","2004 & before","2004 & before","2004 & before","2004 & before","2004 & before","2004 & before","2004 & before"]
["MAG","Nat'l: Open, Jr, Sr",null,{"$f":"COUNTIF('MAG Gymnasts'!$M$5:$M$64,$E19)","v":0},6,12," SK","Marian","Marian Gymnastics Club","Saskatoon",null,4,"National: ","JO-9 (Nat'l)","X","X","X","X","X","2005-2007","2005-2007","2005-2007","X","X","X","X","X","X","X","X"]
[null,null,null,null,null,13," SK","Outlook","Outlook Gymnastics Club","Outlook",null,4,"National: ","JO-10","X","X","X","X","X","X","2003-2006","2003-2006","2003-2006","2003-2006","2002 & before","2002 & before","2002 & before","2002 & before","2002 & before","2002 & before"]
{"$rows_left_out":47}
{"sheet":"Summary","index":1,"n_rows":36,"n_cols":9,"rows_kept":36,"cut":false,"hidden":false,"merged":[[19,8,19,10],[14,4,14,5],[16,8,16,10],[0,4,0,6],[14,8,14,10],[15,8,15,10],[17,8,17,10],[18,8,18,10],[18,4,18,5],[15,4,15,5],[12,4,12,5],[5,5,5,6]]}
["Hide",null,null,null,{"$f":"Lists!Meet_Name","v":"2018 Marian Classic"}]
["This",null,null,null,{"$f":"Lists!Meet_Dates","v":"February 9-11, 2018"}]
["Col."]
[null,null,null,null,"MEET REGISTRATION FOR CLUBS"]
[]
[null,null,null,null,"ENTRY DEADLINE: ",{"$f":"Lists!Entry_Deadline","v":"Tues. Jan. 16, 2018"}]
[]
[null,null,null,null,"When completed, email this file to: ","Meet Director"]
[]
[]
[null,null,null,"Choose your club:  "]
["index",null,null,"Abbrev.","Club Name",null,"City"]
[{"$f":"MATCH(D13,Club_Abbr,0)","v":{"$error":"#N/A"}},null,null,null,{"$f":"IF(ISBLANK(This_Clubs_Abbrev),\"\",INDEX(Lists!I8:I52,A13))","v":""},null,{"$f":"IF(ISBLANK(This_Clubs_Name),\"\",INDEX(Club_City,A13))","v":""}]
[null,null,null,"Contact person:  "]
[null,null,null,"Name:",null,null,null,null,"Please make one cheque payable to …"]
[null,null,null,"Address:",null,null,null,null,"MARIAN GYMNASTICS CLUB"]
[null,null,null,"City  /  PC:"]
[null,null,null,null,null,null,null,null,{"$f":"\"Send the cheque by \"&Lists!Entry_Deadline& \" to:\"","v":"Send the cheque by Tues. Jan. 16, 2018 to:"}]
[null,null,null,"Email:",null,null,null,null,"343 Edson Street   ~   Saskatoon SK   ~   S7J 4C8"]
[null,null,null,"Phone #  /  Cell #:"]
{"$rows_left_out":17}
{"sheet":"WAG Gymnasts","index":2,"n_rows":64,"n_cols":16,"rows_kept":64,"cut":false,"hidden":false,"merged":[[1,3,1,7]]}
[null,{"$f":"Lists!Meet_Name","v":"2018 Marian Classic"},null,"CLUB REGISTRATIONS - WAG GYMNASTS",null,null,null,null,null,null,"Hide Col.","Hide Col.","Hide Col.",null,null,"Hide Col."]
[null,{"$f":"Lists!Meet_Dates","v":"February 9-11, 2018"},"Club: ",{"$f":"This_Clubs_FullName","v":""}]
[null,"xx"]
[null,"First Name","Last Name","Club","City","Year Born","Month Born","Category & age group","Category",{"$f":"\"Age at start of \"&Lists!Year_of_Meet","v":"Age at start of 2018"},"Index 1","Index 2","Category Fee Code","Elite Screening","Comment"]
[1,null,null,{"$f":"IF(ISBLANK(C5),\"\",This_Clubs_Abbrev)","v":""},{"$f":"IF(ISBLANK(C5),\"\",Summary!$G$13)","v":""},null,null,{"$f":"IF(ISBLANK(I5),\"\",I5&IF(P5=0,\"\",\"  (\"&P5&\")\"))","v":""},null,{"$f":"IF(F5=0,0,Lists!Year_of_Meet-F5-1)","v":0},{"$f":"IF(ISBLANK(I5),0,MATCH(I5,WAG_CategoryNames,0))","v":0},{"$f":"IF(J5=0,0,MATCH(J5,Lists!WAG_Age_Range,0))","v":0},{"$f":"IF(K5=0,0,INDEX(WAG_Fee_Codes,K5))","v":0},"No",null,{"$f":"IF(K5+L5=0,0,INDEX(Lists!WAG_SubCategories,K5,L5))","v":0}]
[2,null,null,"",{"$f":"IF(ISBLANK(C6),\"\",Summary!$G$13)","v":""},null,null,"",null,{"$f":"IF(F6=0,0,Lists!Year_of_Meet-F6-1)","v":0},0,{"$f":"IF(J6=0,0,MATCH(J6,Lists!WAG_Age_Range,0))","v":0},0,"No",null,{"$f":"IF(K6+L6=0,0,INDEX(Lists!WAG_SubCategories,K6,L6))","v":0}]
[3,null,null,"",{"$f":"IF(ISBLANK(C7),\"\",Summary!$G$13)","v":""},null,null,"",null,{"$f":"IF(F7=0,0,Lists!Year_of_Meet-F7-1)","v":0},0,{"$f":"IF(J7=0,0,MATCH(J7,Lists!WAG_Age_Range,0))","v":0},0,"No",null,{"$f":"IF(K7+L7=0,0,INDEX(Lists!WAG_SubCategories,K7,L7))","v":0}]
[4,null,null,"",{"$f":"IF(ISBLANK(C8),\"\",Summary!$G$13)","v":""},null,null,"",null,{"$f":"IF(F8=0,0,Lists!Year_of_Meet-F8-1)","v":0},0,{"$f":"IF(J8=0,0,MATCH(J8,Lists!WAG_Age_Range,0))","v":0},0,"No",null,{"$f":"IF(K8+L8=0,0,INDEX(Lists!WAG_SubCategories,K8,L8))","v":0}]
[5,null,null,"",{"$f":"IF(ISBLANK(C9),\"\",Summary!$G$13)","v":""},null,null,"",null,{"$f":"IF(F9=0,0,Lists!Year_of_Meet-F9-1)","v":0},0,{"$f":"IF(J9=0,0,MATCH(J9,Lists!WAG_Age_Range,0))","v":0},0,"No",null,{"$f":"IF(K9+L9=0,0,INDEX(Lists!WAG_SubCategories,K9,L9))","v":0}]
[6,null,null,"",{"$f":"IF(ISBLANK(C10),\"\",Summary!$G$13)","v":""},null,null,"",null,{"$f":"IF(F10=0,0,Lists!Year_of_Meet-F10-1)","v":0},0,{"$f":"IF(J10=0,0,MATCH(J10,Lists!WAG_Age_Range,0))","v":0},0,"No",null,{"$f":"IF(K10+L10=0,0,INDEX(Lists!WAG_SubCategories,K10,L10))","v":0}]
[7,null,null,"",{"$f":"IF(ISBLANK(C11),\"\",Summary!$G$13)","v":""},null,null,"",null,{"$f":"IF(F11=0,0,Lists!Year_of_Meet-F11-1)","v":0},0,{"$f":"IF(J11=0,0,MATCH(J11,Lists!WAG_Age_Range,0))","v":0},0,"No",null,{"$f":"IF(K11+L11=0,0,INDEX(Lists!WAG_SubCategories,K11,L11))","v":0}]
[8,null,null,"",{"$f":"IF(ISBLANK(C12),\"\",Summary!$G$13)","v":""},null,null,"",null,{"$f":"IF(F12=0,0,Lists!Year_of_Meet-F12-1)","v":0},0,{"$f":"IF(J12=0,0,MATCH(J12,Lists!WAG_Age_Range,0))","v":0},0,"No",null,{"$f":"IF(K12+L12=0,0,INDEX(Lists!WAG_SubCategories,K12,L12))","v":0}]
[9,null,null,"",{"$f":"IF(ISBLANK(C13),\"\",Summary!$G$13)","v":""},null,null,"",null,{"$f":"IF(F13=0,0,Lists!Year_of_Meet-F13-1)","v":0},0,{"$f":"IF(J13=0,0,MATCH(J13,Lists!WAG_Age_Range,0))","v":0},0,"No",null,{"$f":"IF(K13+L13=0,0,INDEX(Lists!WAG_SubCategories,K13,L13))","v":0}]
[10,null,null,"",{"$f":"IF(ISBLANK(C14),\"\",Summary!$G$13)","v":""},null,null,"",null,{"$f":"IF(F14=0,0,Lists!Year_of_Meet-F14-1)","v":0},0,{"$f":"IF(J14=0,0,MATCH(J14,Lists!WAG_Age_Range,0))","v":0},0,"No",null,{"$f":"IF(K14+L14=0,0,INDEX(Lists!WAG_SubCategories,K14,L14))","v":0}]
[11,null,null,"",{"$f":"IF(ISBLANK(C15),\"\",Summary!$G$13)","v":""},null,null,"",null,{"$f":"IF(F15=0,0,Lists!Year_of_Meet-F15-1)","v":0},0,{"$f":"IF(J15=0,0,MATCH(J15,Lists!WAG_Age_Range,0))","v":0},0,"No",null,{"$f":"IF(K15+L15=0,0,INDEX(Lists!WAG_SubCategories,K15,L15))","v":0}]
[12,null,null,"",{"$f":"IF(ISBLANK(C16),\"\",Summary!$G$13)","v":""},null,null,"",null,{"$f":"IF(F16=0,0,Lists!Year_of_Meet-F16-1)","v":0},0,{"$f":"IF(J16=0,0,MATCH(J16,Lists!WAG_Age_Range,0))","v":0},0,"No",null,{"$f":"IF(K16+L16=0,0,INDEX(Lists!WAG_SubCategories,K16,L16))","v":0}]
[13,null,null,"",{"$f":"IF(ISBLANK(C17),\"\",Summary!$G$13)","v":""},null,null,"",null,{"$f":"IF(F17=0,0,Lists!Year_of_Meet-F17-1)","v":0},0,{"$f":"IF(J17=0,0,MATCH(J17,Lists!WAG_Age_Range,0))","v":0},0,"No",null,{"$f":"IF(K17+L17=0,0,INDEX(Lists!WAG_SubCategories,K17,L17))","v":0}]
[14,null,null,"",{"$f":"IF(ISBLANK(C18),\"\",Summary!$G$13)","v":""},null,null,"",null,{"$f":"IF(F18=0,0,Lists!Year_of_Meet-F18-1)","v":0},0,{"$f":"IF(J18=0,0,MATCH(J18,Lists!WAG_Age_Range,0))","v":0},0,"No",null,{"$f":"IF(K18+L18=0,0,INDEX(Lists!WAG_SubCategories,K18,L18))","v":0}]
[15,null,null,"",{"$f":"IF(ISBLANK(C19),\"\",Summary!$G$13)","v":""},null,null,"",null,{"$f":"IF(F19=0,0,Lists!Year_of_Meet-F19-1)","v":0},0,{"$f":"IF(J19=0,0,MATCH(J19,Lists!WAG_Age_Range,0))","v":0},0,"No",null,{"$f":"IF(K19+L19=0,0,INDEX(Lists!WAG_SubCategories,K19,L19))","v":0}]
[16,null,null,"",{"$f":"IF(ISBLANK(C20),\"\",Summary!$G$13)","v":""},null,null,"",null,{"$f":"IF(F20=0,0,Lists!Year_of_Meet-F20-1)","v":0},0,{"$f":"IF(J20=0,0,MATCH(J20,Lists!WAG_Age_Range,0))","v":0},0,"No",null,{"$f":"IF(K20+L20=0,0,INDEX(Lists!WAG_SubCategories,K20,L20))","v":0}]
{"$rows_left_out":45}
{"sheet":"WAG Coaches & Judges","index":3,"n_rows":45,"n_cols":13,"rows_kept":45,"cut":false,"hidden":false,"merged":[[4,2,4,5],[7,3,8,3],[7,4,8,4]]}
[null,{"$f":"Meet_Name","v":"2018 Marian Classic"},null,null,null,null,null,null,null,null,null,null,{"$f":"Meet_Dates","v":"February 9-11, 2018"}]
[null,"CLUB REGISTRATION - WAG COACHES & JUDGES"]
[null,"Indicate names of your coaches and judges and their sessions."]
[]
[null,"Club:  ",{"$f":"This_Clubs_FullName","v":""},null,null,null,null,null,"Please mark sessions with \"X\"."]
[null,null,null,null,null,null,null,"(Sessions & Schedule TBA)"]
[null,null,"Please spell names correctly.",null,null,"Session:",1,{"$f":"G7+1","v":2},{"$f":"H7+1","v":3},4,5,6,7]
[null,null,null,"NCCP\nLevel",null,null,{"$f":"IF(ISBLANK($G$7),\"\",\"Fri\")","v":"Fri"},"Sat","Sat","Sat","Sun","Sun","Sun"]
[null,null,"COACHES",null,null,null,{"$f":"IF(ISBLANK($G$7),\"\",\"Eve.\")","v":"Eve."},"Morn.","Aft.","Eve.","Morn.","Noon"," Afternoon"]
[null,1]
[null,2]
[null,3]
[null,4]
[null,5]
[null,6]
[null,7]
[null,8]
[null,9]
[null,10]
[null,11]
{"$rows_left_out":26}
{"sheet":"MAG Gymnasts","index":4,"n_rows":64,"n_cols":15,"rows_kept":64,"cut":false,"hidden":true,"merged":[[2,10,2,11]]}
[null,{"$f":"Meet_Name","v":"2018 Marian Classic"},null,"CLUB REGISTRATION - MEN"]
[null,{"$f":"Meet_Dates","v":"February 9-11, 2018"},"Club:  ",{"$f":"This_Clubs_FullName","v":""}]
[null,null,null,null,null,null,null,null,null,null,"Used to get full cat name (WAG)",null,"Cat.","Elite"]
[null,"First Name","Last Name","Club","City","Birth Year","Birth Month","Category","Category",{"$f":"\"Age in\"&CHAR(13)&Year_of_Meet","v":"Age in\r2018"},"Index 1","Index 2","Level / Fee Code","Screening","Comment"]
[1,null,null,{"$f":"IF(ISBLANK(C5),\"\",This_Clubs_Name)","v":""},{"$f":"IF(ISBLANK(C5),\"\",Summary!$G$13)","v":""},null,null,{"$f":"I5","v":0},null,{"$f":"IF(F5=0,0,Year_of_Meet-F5)","v":0},{"$f":"IF(ISBLANK(I5),\"\",MATCH(I5,MAG_Categories,0))","v":""},{"$f":"IF(J5=0,\"\",MATCH(J5,MAG_Age_Range,0))","v":""},{"$f":"IF(ISBLANK(I5),\"\",INDEX(MAG_Fees_Codes,K5))","v":""},"No"]
[2,null,null,"",{"$f":"IF(ISBLANK(C6),\"\",Summary!$G$13)","v":""},null,null,0,null,0,"",{"$f":"IF(J6=0,\"\",MATCH(J6,MAG_Age_Range,0))","v":""},"","No"]
[3,null,null,"",{"$f":"IF(ISBLANK(C7),\"\",Summary!$G$13)","v":""},null,null,0,null,0,"",{"$f":"IF(J7=0,\"\",MATCH(J7,MAG_Age_Range,0))","v":""},"","No"]
[4,null,null,"",{"$f":"IF(ISBLANK(C8),\"\",Summary!$G$13)","v":""},null,null,0,null,0,"",{"$f":"IF(J8=0,\"\",MATCH(J8,MAG_Age_Range,0))","v":""},"","No"]
[5,null,null,"",{"$f":"IF(ISBLANK(C9),\"\",Summary!$G$13)","v":""},null,null,0,null,0,"",{"$f":"IF(J9=0,\"\",MATCH(J9,MAG_Age_Range,0))","v":""},"","No"]
[6,null,null,"",{"$f":"IF(ISBLANK(C10),\"\",Summary!$G$13)","v":""},null,null,0,null,0,"",{"$f":"IF(J10=0,\"\",MATCH(J10,MAG_Age_Range,0))","v":""},"","No"]
[7,null,null,"",{"$f":"IF(ISBLANK(C11),\"\",Summary!$G$13)","v":""},null,null,0,null,0,"",{"$f":"IF(J11=0,\"\",MATCH(J11,MAG_Age_Range,0))","v":""},"","No"]
[8,null,null,"",{"$f":"IF(ISBLANK(C12),\"\",Summary!$G$13)","v":""},null,null,0,null,0,"",{"$f":"IF(J12=0,\"\",MATCH(J12,MAG_Age_Range,0))","v":""},"","No"]
[9,null,null,"",{"$f":"IF(ISBLANK(C13),\"\",Summary!$G$13)","v":""},null,null,0,null,0,"",{"$f":"IF(J13=0,\"\",MATCH(J13,MAG_Age_Range,0))","v":""},"","No"]
[10,null,null,"",{"$f":"IF(ISBLANK(C14),\"\",Summary!$G$13)","v":""},null,null,0,null,0,"",{"$f":"IF(J14=0,\"\",MATCH(J14,MAG_Age_Range,0))","v":""},"","No"]
[11,null,null,"",{"$f":"IF(ISBLANK(C15),\"\",Summary!$G$13)","v":""},null,null,0,null,0,"",{"$f":"IF(J15=0,\"\",MATCH(J15,MAG_Age_Range,0))","v":""},"","No"]
[12,null,null,"",{"$f":"IF(ISBLANK(C16),\"\",Summary!$G$13)","v":""},null,null,0,null,0,"",{"$f":"IF(J16=0,\"\",MATCH(J16,MAG_Age_Range,0))","v":""},"","No"]
[13,null,null,"",{"$f":"IF(ISBLANK(C17),\"\",Summary!$G$13)","v":""},null,null,0,null,0,"",{"$f":"IF(J17=0,\"\",MATCH(J17,MAG_Age_Range,0))","v":""},"","No"]
[14,null,null,"",{"$f":"IF(ISBLANK(C18),\"\",Summary!$G$13)","v":""},null,null,0,null,0,"",{"$f":"IF(J18=0,\"\",MATCH(J18,MAG_Age_Range,0))","v":""},"","No"]
[15,null,null,"",{"$f":"IF(ISBLANK(C19),\"\",Summary!$G$13)","v":""},null,null,0,null,0,"",{"$f":"IF(J19=0,\"\",MATCH(J19,MAG_Age_Range,0))","v":""},"","No"]
[16,null,null,"",{"$f":"IF(ISBLANK(C20),\"\",Summary!$G$13)","v":""},null,null,0,null,0,"",{"$f":"IF(J20=0,\"\",MATCH(J20,MAG_Age_Range,0))","v":""},"","No"]
{"$rows_left_out":45}
{"sheet":"MAG Coaches & Judges","index":5,"n_rows":45,"n_cols":13,"rows_kept":45,"cut":false,"hidden":true,"merged":[[4,2,4,5],[7,3,8,3],[7,4,8,4]]}
[null,{"$f":"Meet_Name","v":"2018 Marian Classic"},null,null,null,null,null,null,null,null,null,{"$f":"Meet_Dates","v":"February 9-11, 2018"}]
[null,"CLUB REGISTRATION - WAG COACHES & JUDGES"]
[null,"Indicate names of your coaches and judges and their sessions."]
[]
[null,"Club:  ",{"$f":"This_Clubs_FullName","v":""},null,null,null,null,null,"Please mark sessions with \"X\"."]
[null,null,null,null,null,null,null,"(Sessions & Schedule TBA)"]
[null,null,"Please spell names correctly.",null,null,"Session:",1,{"$f":"G7+1","v":2},{"$f":"H7+1","v":3},4,5,6,7]
[null,null,null,"NCCP\nLevel",null,null,{"$f":"IF(ISBLANK($G$7),\"\",\"Fri\")","v":"Fri"},"Sat","Sat","Sat","Sun","Sun","Sun"]
[null,null,"COACHES",null,null,null,{"$f":"IF(ISBLANK($G$7),\"\",\"Eve.\")","v":"Eve."},"Morn.","Aft.","Eve.","Morn.","Aft.","Eve."]
[null,1]
[null,2]
[null,3]
[null,4]
[null,5]
[null,6]
[null,7]
[null,8]
[null,9]
[null,10]
[null,11]
{"$rows_left_out":26}
{"sheet":"Pswd","index":6,"n_rows":10,"n_cols":2,"rows_kept":10,"cut":false,"hidden":true,"merged":[]}
[]
[]
[]
[null,"Password for all sheets:"]
[]
[null,"GymScore-Registration"]
[]
[]
[]
[null,"No Password needed - 2018"]