{"text_format":"1","workbook":"xlsx","n_sheets":7,"sheets":["Lists","Summary","WAG Gymnasts","WAG Coaches & Judges","MAG Gymnasts","MAG Coaches & Judges","Pswd"],"not_rendered":{"charts":0,"images":1,"macros":1,"external_links":0,"defined_names":30,"comments":1,"pivot_tables":0},"unopened":[],"bounds":{"document_bytes":16777216,"sheet_cells":100000,"rows_first":2000,"rows_last":500,"rows_between":2000,"halvings":0,"cell_chars":16384,"cell_head_chars":4096},"cells_cut":0,"cells_raw":0,"read":"whole","date_system":"1900"}

{"sheet":"Lists","index":0,"n_rows":64,"n_cols":30,"rows_kept":64,"cut":false,"hidden":true,"merged":[]}
["Lists used on other sheets…",null,null,"Year of Meet: ",2018,null,null,"Title: ","QUEEN CITY INVITATIONAL 2018",null,null,null,null,null,"Yes No Reply"]
[null,null,null,null,null,null,null,"Dates: ","January 19-21, 2018",null,null,null,null,null,"Yes"]
["Note: ","Hide this sheet normally, ",null,null,null,null,null,"Deadline: ","Tues. Nov. 28, 2017",null,null,null,null,null,"No"]
[null,"especially before sending the file to clubs.",null,null,null,null,null,null,null,null,null,null,null,null,null,null,"Note: Change these age groups within the categories as needed - see Gym Sask guide in November each year for the following season."]
[null,null,null,null,null,null,null,null,null,null,null,null,"Year of Competition: ",{"$f":"Year_of_Meet","v":2018},"**  Ages shown are as of end of previous year (aka the start of this year).    Nat'l levels use age as of Dec 31 in current year."]
[null,"FEES:",null,null,null,null,null,"Invited Gym Clubs…",null,null,null,"Code for",null,"Year Born:",{"$f":"N5-6","v":2012},{"$f":"O6-1","v":2011},{"$f":"P6-1","v":2010},2009,2008,2007,2006,2005,2004,2003,2002,2001,2000,1999,1998,1997]
[null,"Level","$/gymnast","# gymnasts",null,null,"Prov.","Club_Abbr","Club_Name","Club_City",null,"Fees Level","WAG_Categories  ",{"$f":"\"Age at start of \" &$N$5&\":\"","v":"Age at start of 2018:"},{"$f":"$N$5-O6-1","v":5},{"$f":"O7+1","v":6},{"$f":"P7+1","v":7},8,9,10,11,12,13,14,15,16,17,18,19,20]
["WAG","Dev:  JO 1-2",60,{"$f":"COUNTIF('WAG Gymnasts'!$M$5:$M$64,1)","v":0},null,1," SK"," Queen City ","Queen City Gymnastics Club","Regina",null,1,"Development:  ","JO-1","X",null,null,null,null,null,null,null,null,null,"X","X","X","X","X","X"]
["WAG","Prov:  JO 3-8",90,{"$f":"COUNTIF('WAG Gymnasts'!$M$5:$M$64,2)","v":0},null,2," SK","Airborne","Airborne Gymnastics Club","Weyburn",null,1,"Development:  ","JO-2","X",null,null,null,null,null,null,null,null,null,"X","X","X","X","X","X"]
["WAG","Nat'l:  JO 9-10",90,{"$f":"COUNTIF('WAG Gymnasts'!$M$5:$M$64,3)","v":0},null,3," SK","Battleford","Battlefords Gymnastics Club","North Battleford",null,2,"Provincial: ","JO-3","X","X"]
["WAG","Aspire 1-2",90,{"$f":"COUNTIF('WAG Gymnasts'!$M$5:$M$64,4)","v":0},null,4," SK","Calico","Calico Gymnastics Club","Humboldt",null,2,"Provincial: ","JO-4","X","X","X"]
["WAG","High Performance",90,{"$f":"COUNTIF('WAG Gymnasts'!$M$5:$M$64,5)","v":0},null,5," SK","Can-Am","Can-Am Gymnastics Club","Saskatoon",null,2,"Provincial: ","JO-5","X","X","X"]
["MAG","JO 3",50,{"$f":"COUNTIF('MAG Gymnasts'!$M$5:$M$64,6)","v":0},null,6," SK","Estevan","Estevan Gymnastics Club","Estevan",null,2,"Provincial: ","JO-6","X","X","X"]
["MAG","JO 4-7",90,{"$f":"COUNTIF('MAG Gymnasts'!$M$5:$M$64,7)","v":0},null,7," SK","Explosion","Explosion Gymnastics Club","Lloydminster",null,2,"Provincial: ","JO-7","X","X","X","X"]
["MAG","Prov 4-5",90,{"$f":"COUNTIF('MAG Gymnasts'!$M$5:$M$64,8)","v":0},null,8," SK","Gelico","Gelico Gymnastics Club","Swift Current",null,2,"Provincial: ","JO-8","X","X","X","X"]
["MAG","Elite 3-4",90,{"$f":"COUNTIF('MAG Gymnasts'!$M$5:$M$64,9)","v":0},null,9," SK","Gym Adv","Gymnastics Adventure Inc.","Regina",null,3,"National: ","JO-9","X","X","X","X","X"]
["MAG","Nat'l",90,{"$f":"COUNTIF('MAG Gymnasts'!$M$5:$M$64,10)","v":0},null,10," SK","Gymtastiks","Gymtastiks Gymnastics Club","Moose Jaw",null,3,"National: ","JO-10","X","X","X","X","X","X"]
[null,null,null,null,null,11," SK","Jumpers","Moose Mountain Jumpers Gymnastics Club","Carlyle",null,4,"Aspire: ","Aspire 1","X","X","X",null,null,null,"X","X","X","X","X","X","X","X","X","X"]
[null,null,null,null,null,12," SK","Leapers","Lampman Leapers Gymnastics Club","Lampman",null,4,"Aspire: ","Aspire 2","X","X","X","X",null,null,null,"X","X","X","X","X","X","X","X","X"]
[null,null,null,null,null,13," SK","Marian","Marian Gymnastics Club","Saskatoon",null,5,"High Performance:  ","HP Novice","X","X","X","X","X",null,null,null,"X","X","X","X","X","X","X","X"]
[null,null,null,null,null,14," SK","Outlook","Outlook Gymnastics Club","Outlook",null,5,"High Performance:  ","HP Junior","X","X","X","X","X","X",null,null,null,null,"X","X","X","X","X","X"]
[null,null,null,null,null,15," SK","PA Aerials","Aerials Gymnastics Club","Prince Albert",null,5,"High Performance:  ","HP Senior","X","X","X","X","X","X","X","X","X"]
[null,null,null,null,null,16," SK","Perf. Bal.","Perfect Balance Gymnastics Club","Hudson Bay"]
[null,null,null,null,null,17," SK","Rose","Rosetown Gymnastics Club","Rosetown"]
[null,null,null,null,null,18," SK","Springers-SK","Shamrock Springers Gymnastics Club","Yorkton"]
[null,null,null,null,null,19," SK","Taiso","Taiso Gymnastics Club","Saskatoon",null,"Code for",null,null,"Ages…  (in competitive year)",null,null,null,"Probably not needed, no sublevels.  May be used to check valid ages for some like HP ARGO, etc."]
[null,null,null,null,null,20,"SK","Tumblers","Tumblers Gymnastics","Martensville",null,"Fees Level",null,"MAG_Categories",6,7,8,9,10,11,12,13,14,15,16,17,18,19,20,21]
[null,null,null,null,null,20," SK","Turn-a-Row","Turn-A-Row Gymnastics Club","Wadena",null,6,"Developmental: ","JO-3"]
[null,null,null,null,null,21," SK","Twisters","Twisters Gymnastics Club","Tisdale",null,7,"Jr. Olympic: ","JO-4"]
[null,null,null,null,null,22," SK","Zero Gravity","Zero Gravity Gymnastics Club","Gull Lake",null,7,"Jr. Olympic: ","JO-5"]
{"$rows_left_out":35}
{"sheet":"Summary","index":1,"n_rows":34,"n_cols":9,"rows_kept":34,"cut":false,"hidden":false,"merged":[[19,8,19,10],[14,4,14,5],[16,8,16,10],[0,4,0,6],[14,8,14,10],[15,8,15,10],[17,8,17,10],[18,8,18,10],[18,4,18,5],[15,4,15,5],[12,4,12,5],[5,5,5,6]]}
["Hide",null,null,null,{"$f":"Lists!I1","v":"QUEEN CITY INVITATIONAL 2018"}]
["This",null,null,null,{"$f":"Meet_Dates","v":"January 19-21, 2018"}]
["Col."]
[null,null,null,null,"MEET REGISTRATION FOR CLUBS"]
[]
[null,null,null,null,"ENTRY DEADLINE: ",{"$f":"Lists!I3","v":"Tues. Nov. 28, 2017"}]
[]
[null,null,null,null,"When completed, email this file to: ","QCGC Meet Director"]
[]
[]
[null,null,null,"Choose your club:  "]
[null,null,null,"Abbrev.","Club Name",null,"City"]
[{"$f":"MATCH(D13,Club_Abbr,0)","v":{"$error":"#N/A"}},null,null,null,{"$f":"IF(ISBLANK(This_Clubs_Name),\"\",INDEX(Club_Name,A13))","v":""},null,{"$f":"IF(ISBLANK(This_Clubs_Name),\"\",INDEX(Club_City,A13))","v":""}]
[null,null,null,"Contact person:  "]
[null,null,null,"Name:",null,null,null,null,"Please make one cheque payable to …"]
[null,null,null,"Address:",null,null,null,null,"QUEEN CITY GYMNASTICS CLUB"]
[null,null,null,"City  /  PC:",null,null,null,null,{"$f":"\"Send the cheque by \"&Entry_Deadline& \" to:\"","v":"Send the cheque by Tues. Nov. 28, 2017 to:"}]
[null,null,null,null,null,null,null,null,"455 Maxwell Crescent   ~   Regina, SK   ~   S4N 5X9"]
[null,null,null,"Email:",null,null,null,null,"Phone:  (306) 539-9630    (Meet Director - Sherie Franklin)"]
[null,null,null,"Phone #  /  Cell #:"]
[null,null,null,null,null,null,null,null,"Registration is not complete until fees and athlete release forms have been received."]
[null,null,"Fee Summary…","(Based on the WAG & MAG athlete sheets)",null,null,null,null,"NOTE:    A late fee of $50 per gymnast will be charged."]
[null,null,"Discipline / Type","# Gymnasts","Fee per gymnast","Amount   ",null,null,"Refunds will be issued only for medical reasons upon receipt of a doctor’s certificate."]
[null,null,"WAG:  Dev:  Jr Olympic 1-2",{"$f":"Lists!D8","v":0},{"$f":"Lists!C8","v":60},{"$f":"D24*E24","v":0}]
[null,null,"WAG:  Prov:  Jr Olympic 3-8",{"$f":"Lists!D9","v":0},{"$f":"Lists!C9","v":90},{"$f":"D25*E25","v":0}]
[null,null,"WAG:  Nat'l:  Jr Olympic 9-10",{"$f":"Lists!D10","v":0},{"$f":"Lists!C10","v":90},{"$f":"D26*E26","v":0}]
[null,null,"WAG:  Aspire 1-2",{"$f":"Lists!D11","v":0},{"$f":"Lists!C11","v":90},0]
[null,null,"WAG: HP  (Novice, Jr, Sr)",{"$f":"Lists!D12","v":0},{"$f":"Lists!C12","v":90},{"$f":"D28*E28","v":0}]
[null,null,"MAG:  Dev:  JO 3",{"$f":"Lists!D13","v":0},{"$f":"Lists!C13","v":50},{"$f":"D29*E29","v":0}]
[null,null,"MAG:  Jr. Olympic  4-7",{"$f":"Lists!D14","v":0},{"$f":"Lists!C14","v":90},0]
{"$rows_left_out":5}
{"sheet":"WAG Gymnasts","index":2,"n_rows":64,"n_cols":16,"rows_kept":64,"cut":false,"hidden":false,"merged":[[1,3,1,7]]}
[null,{"$f":"Meet_Name","v":"QUEEN CITY INVITATIONAL 2018"},null,"CLUB REGISTRATIONS - WAG GYMNASTS",null,null,null,null,null,null,"Hide Col.","Hide Col.","Hide Col.",null,null,"Hide Col."]
[null,{"$f":"Meet_Dates","v":"January 19-21, 2018"},"Club: ",{"$f":"This_Clubs_FullName","v":""}]
[null,"xx"]
[null,"First Name","Last Name","Club","City","Year Born","Month Born","Category & age group","Category",{"$f":"\"Age at start of \"&Year_of_Meet","v":"Age at start of 2018"},"Index 1","Index 2","Category Fee Code","Elite Screening","Comment"]
[1,null,null,{"$f":"IF(ISBLANK(C5),\"\",This_Clubs_Abbrev)","v":""},{"$f":"IF(ISBLANK(C5),\"\",Summary!$G$13)","v":""},null,null,{"$f":"IF(ISBLANK(I5),\"\",I5&IF(P5=0,\"\",\"  (\"&P5&\")\"))","v":""},null,{"$f":"IF(F5=0,0,Year_of_Meet-F5-1)","v":0},{"$f":"IF(ISBLANK(I5),0,MATCH(I5,WAG_Categories,0))","v":0},{"$f":"IF(J5=0,0,MATCH(J5,WAG_Age_Range,0))","v":0},{"$f":"IF(K5=0,0,INDEX(Lists!$L$8:$L$22,K5))","v":0},"No",null,{"$f":"IF(K5+L5=0,0,INDEX(WAG_SubCategories,K5,L5))","v":0}]
[2,null,null,"",{"$f":"IF(ISBLANK(C6),\"\",Summary!$G$13)","v":""},null,null,"",null,0,0,0,{"$f":"IF(K6=0,0,INDEX(Lists!$L$8:$L$22,K6))","v":0},"No",null,0]
[3,null,null,"",{"$f":"IF(ISBLANK(C7),\"\",Summary!$G$13)","v":""},null,null,"",null,0,0,0,{"$f":"IF(K7=0,0,INDEX(Lists!$L$8:$L$22,K7))","v":0},"No",null,0]
[4,null,null,"",{"$f":"IF(ISBLANK(C8),\"\",Summary!$G$13)","v":""},null,null,"",null,0,0,0,{"$f":"IF(K8=0,0,INDEX(Lists!$L$8:$L$22,K8))","v":0},"No",null,0]
[5,null,null,"",{"$f":"IF(ISBLANK(C9),\"\",Summary!$G$13)","v":""},null,null,"",null,0,0,0,{"$f":"IF(K9=0,0,INDEX(Lists!$L$8:$L$22,K9))","v":0},"No",null,0]
[6,null,null,"",{"$f":"IF(ISBLANK(C10),\"\",Summary!$G$13)","v":""},null,null,"",null,0,0,0,{"$f":"IF(K10=0,0,INDEX(Lists!$L$8:$L$22,K10))","v":0},"No",null,0]
[7,null,null,"",{"$f":"IF(ISBLANK(C11),\"\",Summary!$G$13)","v":""},null,null,"",null,0,0,0,{"$f":"IF(K11=0,0,INDEX(Lists!$L$8:$L$22,K11))","v":0},"No",null,0]
[8,null,null,"",{"$f":"IF(ISBLANK(C12),\"\",Summary!$G$13)","v":""},null,null,"",null,0,0,0,{"$f":"IF(K12=0,0,INDEX(Lists!$L$8:$L$22,K12))","v":0},"No",null,0]
[9,null,null,"",{"$f":"IF(ISBLANK(C13),\"\",Summary!$G$13)","v":""},null,null,"",null,0,0,0,{"$f":"IF(K13=0,0,INDEX(Lists!$L$8:$L$22,K13))","v":0},"No",null,0]
[10,null,null,"",{"$f":"IF(ISBLANK(C14),\"\",Summary!$G$13)","v":""},null,null,"",null,0,0,0,{"$f":"IF(K14=0,0,INDEX(Lists!$L$8:$L$22,K14))","v":0},"No",null,0]
[11,null,null,"",{"$f":"IF(ISBLANK(C15),\"\",Summary!$G$13)","v":""},null,null,"",null,0,0,0,{"$f":"IF(K15=0,0,INDEX(Lists!$L$8:$L$22,K15))","v":0},"No",null,0]
[12,null,null,"",{"$f":"IF(ISBLANK(C16),\"\",Summary!$G$13)","v":""},null,null,"",null,0,0,0,{"$f":"IF(K16=0,0,INDEX(Lists!$L$8:$L$22,K16))","v":0},"No",null,0]
[13,null,null,"",{"$f":"IF(ISBLANK(C17),\"\",Summary!$G$13)","v":""},null,null,"",null,0,0,0,{"$f":"IF(K17=0,0,INDEX(Lists!$L$8:$L$22,K17))","v":0},"No",null,0]
[14,null,null,"",{"$f":"IF(ISBLANK(C18),\"\",Summary!$G$13)","v":""},null,null,"",null,0,0,0,{"$f":"IF(K18=0,0,INDEX(Lists!$L$8:$L$22,K18))","v":0},"No",null,0]
[15,null,null,"",{"$f":"IF(ISBLANK(C19),\"\",Summary!$G$13)","v":""},null,null,"",null,0,0,0,{"$f":"IF(K19=0,0,INDEX(Lists!$L$8:$L$22,K19))","v":0},"No",null,0]
[16,null,null,"",{"$f":"IF(ISBLANK(C20),\"\",Summary!$G$13)","v":""},null,null,"",null,0,0,0,{"$f":"IF(K20=0,0,INDEX(Lists!$L$8:$L$22,K20))","v":0},"No",null,0]
[17,null,null,"",{"$f":"IF(ISBLANK(C21),\"\",Summary!$G$13)","v":""},null,null,"",null,0,0,0,{"$f":"IF(K21=0,0,INDEX(Lists!$L$8:$L$22,K21))","v":0},"No",null,0]
[18,null,null,"",{"$f":"IF(ISBLANK(C22),\"\",Summary!$G$13)","v":""},null,null,"",null,0,0,0,{"$f":"IF(K22=0,0,INDEX(Lists!$L$8:$L$22,K22))","v":0},"No",null,0]
[19,null,null,"",{"$f":"IF(ISBLANK(C23),\"\",Summary!$G$13)","v":""},null,null,"",null,0,0,0,{"$f":"IF(K23=0,0,INDEX(Lists!$L$8:$L$22,K23))","v":0},"No",null,0]
[20,null,null,"",{"$f":"IF(ISBLANK(C24),\"\",Summary!$G$13)","v":""},null,null,"",null,0,0,0,{"$f":"IF(K24=0,0,INDEX(Lists!$L$8:$L$22,K24))","v":0},"No",null,0]
[21,null,null,"",{"$f":"IF(ISBLANK(C25),\"\",Summary!$G$13)","v":""},null,null,"",null,0,0,0,{"$f":"IF(K25=0,0,INDEX(Lists!$L$8:$L$22,K25))","v":0},"No",null,0]
[22,null,null,null,{"$f":"IF(ISBLANK(C26),\"\",Summary!$G$13)","v":""},null,null,"",null,0,0,0,{"$f":"IF(K26=0,0,INDEX(Lists!$L$8:$L$22,K26))","v":0},"No",null,0]
[23,null,null,{"$f":"IF(ISBLANK(C27),\"\",This_Clubs_Abbrev)","v":""},{"$f":"IF(ISBLANK(C27),\"\",Summary!$G$13)","v":""},null,null,"",null,0,0,0,{"$f":"IF(K27=0,0,INDEX(Lists!$L$8:$L$22,K27))","v":0},"No",null,0]
[24,null,null,"",{"$f":"IF(ISBLANK(C28),\"\",Summary!$G$13)","v":""},null,null,"",null,0,0,0,{"$f":"IF(K28=0,0,INDEX(Lists!$L$8:$L$22,K28))","v":0},"No",null,0]
[25,null,null,"",{"$f":"IF(ISBLANK(C29),\"\",Summary!$G$13)","v":""},null,null,"",null,0,0,0,{"$f":"IF(K29=0,0,INDEX(Lists!$L$8:$L$22,K29))","v":0},"No",null,0]
[26,null,null,"",{"$f":"IF(ISBLANK(C30),\"\",Summary!$G$13)","v":""},null,null,"",null,0,0,0,{"$f":"IF(K30=0,0,INDEX(Lists!$L$8:$L$22,K30))","v":0},"No",null,0]
{"$rows_left_out":35}
{"sheet":"WAG Coaches & Judges","index":3,"n_rows":45,"n_cols":13,"rows_kept":45,"cut":false,"hidden":false,"merged":[[4,2,4,5],[7,3,8,3],[7,4,8,4]]}
[null,{"$f":"Meet_Name","v":"QUEEN CITY INVITATIONAL 2018"},null,null,null,null,null,null,null,null,null,null,{"$f":"Meet_Dates","v":"January 19-21, 2018"}]
[null,"CLUB REGISTRATION - WAG COACHES & JUDGES"]
[null,"Indicate names of your coaches and judges and their sessions."]
[]
[null,"Club:  ",{"$f":"This_Clubs_FullName","v":""},null,null,null,null,null,"Please mark sessions with \"X\"."]
[null,null,null,null,null,null,null,"(Sessions & Schedule TBA)"]
[null,null,"Please spell names correctly.",null,null,"Session:",1,{"$f":"G7+1","v":2},{"$f":"H7+1","v":3},4,5,6,7]
[null,null,null,"NCCP\nLevel",null,null,{"$f":"IF(ISBLANK($G$7),\"\",\"Fri\")","v":"Fri"},"Sat","Sat","Sat","Sun","Sun","Sun"]
[null,null,"COACHES",null,null,null,{"$f":"IF(ISBLANK($G$7),\"\",\"Eve.\")","v":"Eve."},"Morn.","Aft.","Eve.","Morn.","Noon"," Afternoon"]
[null,1]
[null,2]
[null,3]
[null,4]
[null,5]
[null,6]
[null,7]
[null,8]
[null,9]
[null,10]
[null,11]
[null,12]
[null,13]
[null,14]
[null,15]
[]
[]
[]
[null,null,null,null,null,"Session:",{"$f":"IF(ISBLANK($G$7),\"\",$G$7)","v":1},{"$f":"H7","v":2},3,4,5,6,7]
[null,null,null,null,null,null,{"$f":"G8","v":"Fri"},{"$f":"H8","v":"Sat"},"Sat","Sat","Sun","Sun","Sun"]
[null,null,"JUDGES","Level",null,null,{"$f":"G9","v":"Eve."},{"$f":"H9","v":"Morn."},"Aft.","Eve.","Morn.","Noon"," Afternoon"]
{"$rows_left_out":16}
{"sheet":"MAG Gymnasts","index":4,"n_rows":64,"n_cols":15,"rows_kept":64,"cut":false,"hidden":false,"merged":[[2,10,2,11]]}
[null,{"$f":"Meet_Name","v":"QUEEN CITY INVITATIONAL 2018"},null,"CLUB REGISTRATION - MEN"]
[null,{"$f":"Meet_Dates","v":"January 19-21, 2018"},"Club:  ",{"$f":"This_Clubs_FullName","v":""}]
[null,null,null,null,null,null,null,null,null,null,"Used to get full cat name",null,"Cat.","Elite"]
[null,"First Name","Last Name","Club","City","Birth Year","Birth Month","Category","Category",{"$f":"\"Age in\"&CHAR(13)&Year_of_Meet","v":"Age in\r2018"},"Index 1","Index 2","Fee Code","Screening","Comment"]
[1,null,null,{"$f":"IF(ISBLANK(C5),\"\",This_Clubs_Name)","v":""},{"$f":"IF(ISBLANK(C5),\"\",Summary!$G$13)","v":""},null,null,{"$f":"I5","v":0},null,{"$f":"IF(F5=0,0,Year_of_Meet-F5)","v":0},{"$f":"IF(ISBLANK(I5),\"\",MATCH(I5,MAG_Categories,0))","v":""},{"$f":"IF(J5=0,\"\",MATCH(J5,MAG_Age_Range,0))","v":""},{"$f":"IF(ISBLANK(I5),\"\",INDEX(MAG_Fees_Codes,K5))","v":""},"No"]
[2,null,null,"",{"$f":"IF(ISBLANK(C6),\"\",Summary!$G$13)","v":""},null,null,0,null,0,"",{"$f":"IF(J6=0,\"\",MATCH(J6,MAG_Age_Range,0))","v":""},"","No"]
[3,null,null,"",{"$f":"IF(ISBLANK(C7),\"\",Summary!$G$13)","v":""},null,null,0,null,0,"",{"$f":"IF(J7=0,\"\",MATCH(J7,MAG_Age_Range,0))","v":""},"","No"]
[4,null,null,"",{"$f":"IF(ISBLANK(C8),\"\",Summary!$G$13)","v":""},null,null,0,null,0,"",{"$f":"IF(J8=0,\"\",MATCH(J8,MAG_Age_Range,0))","v":""},"","No"]
[5,null,null,"",{"$f":"IF(ISBLANK(C9),\"\",Summary!$G$13)","v":""},null,null,0,null,0,"",{"$f":"IF(J9=0,\"\",MATCH(J9,MAG_Age_Range,0))","v":""},"","No"]
[6,null,null,"",{"$f":"IF(ISBLANK(C10),\"\",Summary!$G$13)","v":""},null,null,0,null,0,"",{"$f":"IF(J10=0,\"\",MATCH(J10,MAG_Age_Range,0))","v":""},"","No"]
[7,null,null,"",{"$f":"IF(ISBLANK(C11),\"\",Summary!$G$13)","v":""},null,null,0,null,0,"",{"$f":"IF(J11=0,\"\",MATCH(J11,MAG_Age_Range,0))","v":""},"","No"]
[8,null,null,"",{"$f":"IF(ISBLANK(C12),\"\",Summary!$G$13)","v":""},null,null,0,null,0,"",{"$f":"IF(J12=0,\"\",MATCH(J12,MAG_Age_Range,0))","v":""},"","No"]
[9,null,null,"",{"$f":"IF(ISBLANK(C13),\"\",Summary!$G$13)","v":""},null,null,0,null,0,"",{"$f":"IF(J13=0,\"\",MATCH(J13,MAG_Age_Range,0))","v":""},"","No"]
[10,null,null,"",{"$f":"IF(ISBLANK(C14),\"\",Summary!$G$13)","v":""},null,null,0,null,0,"",{"$f":"IF(J14=0,\"\",MATCH(J14,MAG_Age_Range,0))","v":""},"","No"]
[11,null,null,"",{"$f":"IF(ISBLANK(C15),\"\",Summary!$G$13)","v":""},null,null,0,null,0,"",{"$f":"IF(J15=0,\"\",MATCH(J15,MAG_Age_Range,0))","v":""},"","No"]
[12,null,null,"",{"$f":"IF(ISBLANK(C16),\"\",Summary!$G$13)","v":""},null,null,0,null,0,"",{"$f":"IF(J16=0,\"\",MATCH(J16,MAG_Age_Range,0))","v":""},"","No"]
[13,null,null,"",{"$f":"IF(ISBLANK(C17),\"\",Summary!$G$13)","v":""},null,null,0,null,0,"",{"$f":"IF(J17=0,\"\",MATCH(J17,MAG_Age_Range,0))","v":""},"","No"]
[14,null,null,"",{"$f":"IF(ISBLANK(C18),\"\",Summary!$G$13)","v":""},null,null,0,null,0,"",{"$f":"IF(J18=0,\"\",MATCH(J18,MAG_Age_Range,0))","v":""},"","No"]
[15,null,null,"",{"$f":"IF(ISBLANK(C19),\"\",Summary!$G$13)","v":""},null,null,0,null,0,"",{"$f":"IF(J19=0,\"\",MATCH(J19,MAG_Age_Range,0))","v":""},"","No"]
[16,null,null,"",{"$f":"IF(ISBLANK(C20),\"\",Summary!$G$13)","v":""},null,null,0,null,0,"",{"$f":"IF(J20=0,\"\",MATCH(J20,MAG_Age_Range,0))","v":""},"","No"]
[17,null,null,"",{"$f":"IF(ISBLANK(C21),\"\",Summary!$G$13)","v":""},null,null,0,null,0,"",{"$f":"IF(J21=0,\"\",MATCH(J21,MAG_Age_Range,0))","v":""},"","No"]
[18,null,null,"",{"$f":"IF(ISBLANK(C22),\"\",Summary!$G$13)","v":""},null,null,0,null,0,"",{"$f":"IF(J22=0,\"\",MATCH(J22,MAG_Age_Range,0))","v":""},"","No"]
[19,null,null,"",{"$f":"IF(ISBLANK(C23),\"\",Summary!$G$13)","v":""},null,null,0,null,0,"",{"$f":"IF(J23=0,\"\",MATCH(J23,MAG_Age_Range,0))","v":""},"","No"]
[20,null,null,"",{"$f":"IF(ISBLANK(C24),\"\",Summary!$G$13)","v":""},null,null,0,null,0,"",{"$f":"IF(J24=0,\"\",MATCH(J24,MAG_Age_Range,0))","v":""},"","No"]
[21,null,null,"",{"$f":"IF(ISBLANK(C25),\"\",Summary!$G$13)","v":""},null,null,0,null,0,"",{"$f":"IF(J25=0,\"\",MATCH(J25,MAG_Age_Range,0))","v":""},"","No"]
[22,null,null,"",{"$f":"IF(ISBLANK(C26),\"\",Summary!$G$13)","v":""},null,null,0,null,0,"",{"$f":"IF(J26=0,\"\",MATCH(J26,MAG_Age_Range,0))","v":""},"","No"]
[23,null,null,"",{"$f":"IF(ISBLANK(C27),\"\",Summary!$G$13)","v":""},null,null,0,null,0,"",{"$f":"IF(J27=0,\"\",MATCH(J27,MAG_Age_Range,0))","v":""},"","No"]
[24,null,null,"",{"$f":"IF(ISBLANK(C28),\"\",Summary!$G$13)","v":""},null,null,0,null,0,"",{"$f":"IF(J28=0,\"\",MATCH(J28,MAG_Age_Range,0))","v":""},"","No"]
[25,null,null,"",{"$f":"IF(ISBLANK(C29),\"\",Summary!$G$13)","v":""},null,null,0,null,0,"",{"$f":"IF(J29=0,\"\",MATCH(J29,MAG_Age_Range,0))","v":""},"","No"]
[26,null,null,"",{"$f":"IF(ISBLANK(C30),\"\",Summary!$G$13)","v":""},null,null,0,null,0,"",{"$f":"IF(J30=0,\"\",MATCH(J30,MAG_Age_Range,0))","v":""},"","No"]
{"$rows_left_out":35}
{"sheet":"MAG Coaches & Judges","index":5,"n_rows":45,"n_cols":13,"rows_kept":45,"cut":false,"hidden":false,"merged":[[4,2,4,5],[7,3,8,3],[7,4,8,4]]}
[null,{"$f":"Meet_Name","v":"QUEEN CITY INVITATIONAL 2018"},null,null,null,null,null,null,null,null,null,{"$f":"Meet_Dates","v":"January 19-21, 2018"}]
[null,"CLUB REGISTRATION - WAG COACHES & JUDGES"]
[null,"Indicate names of your coaches and judges and their sessions."]
[]
[null,"Club:  ",{"$f":"This_Clubs_FullName","v":""},null,null,null,null,null,"Please mark sessions with \"X\"."]
[]
[null,null,"Please spell names correctly.",null,null,"Session:",1,{"$f":"G7+1","v":2},{"$f":"H7+1","v":3},4,5,6,7]
[null,null,null,"NCCP\nLevel",null,null,{"$f":"IF(ISBLANK($G$7),\"\",\"Fri\")","v":"Fri"},"Sat","Sat","Sat","Sun","Sun","Sun"]
[null,null,"COACHES",null,null,null,{"$f":"IF(ISBLANK($G$7),\"\",\"Eve.\")","v":"Eve."},"Morn.","Aft.","Eve.","Morn.","Aft.","Eve."]
[null,1]
[null,2]
[null,3]
[null,4]
[null,5]
[null,6]
[null,7]
[null,8]
[null,9]
[null,10]
[null,11]
[null,12]
[null,13]
[null,14]
[null,15]
[]
[]
[]
[null,null,null,null,null,"Session:",{"$f":"IF(ISBLANK($G$7),\"\",$G$7)","v":1},{"$f":"H7","v":2},3,4,5,6,7]
[null,null,null,null,null,null,{"$f":"G8","v":"Fri"},"Sat","Sat","Sat","Sun","Sun","Sun"]
[null,null,"JUDGES","Level",null,null,{"$f":"G9","v":"Eve."},"Morn.","Aft.","Eve.","Morn.","Aft.","Eve."]
{"$rows_left_out":16}
{"sheet":"Pswd","index":6,"n_rows":6,"n_cols":2,"rows_kept":6,"cut":false,"hidden":true,"merged":[]}
[]
[]
[]
[null,"Password for all sheets:"]
[]
[null,"GymScore-Registration"]